audit/FastDateFormatTest fails in 4.2.0 and master

classic Classic list List threaded Threaded
1 message Options
Reply | Threaded
Open this post in threaded view
|

audit/FastDateFormatTest fails in 4.2.0 and master

Erwin Hogeweg
Hi,

The FastDateFormatTest fails on Windows and Mac with Java-8 (and the failure doesn't make any sense…).

Has anyone else experienced this?


Thanks,

Erwin

[INFO] Running org.apache.karaf.audit.TestPerf
[WARNING] Tests run: 1, Failures: 0, Errors: 0, Skipped: 1, Time elapsed: 0 s - in org.apache.karaf.audit.TestPerf
[INFO]
[INFO] Results:
[INFO]
[ERROR] Failures:
[ERROR]   FastDateFormatTest.test:39 expected:<Nov [10]> but was:<Nov [ 9]>
[INFO]
[ERROR] Tests run: 9, Failures: 1, Errors: 0, Skipped: 1